Welcome, Guest
Username: Password: Remember me
26 Sep 2020
No bulk downloads - PLEASE! THIS IS OVERLOADING OUR SERVER AND DENYING ACCESS TO COMMUNITY USERS
SVP - Pas de téléchargement en masse ! Cela surcharge le serveur et empêche la communauté d'utilisateurs d'accéder aux données
_______________________________
WE WILL BLOCK IP'S THAT ARE BULK DOWNLOADING! Nous bloquerons les IPs des personnes qui agissent de la sorte.
PLEASE GO DIRECTLY TO THE GRIB PRODUCERS (NOAA, DWD...) FOR BULK DOWNLOADS. Allez chercher les données directement à la source (NOAA, DWD ...)
Read More...
  • Page:
  • 1

TOPIC:

Deçu par l'absence de réponse... 2 years 7 months ago #465

... à mon message
Compilation : erreur cmake sur arm64
Même 'm...e' fait toujours plaisir

Please Log in or Create an account to join the conversation.

Deçu par l'absence de réponse... 2 years 7 months ago #466

Sorry, I somehow missed your thread on the compilation problems.

Try and comment out the line
add_subdirectory(data/tr)

line 230 in CMakeLists.txt

David

Please Log in or Create an account to join the conversation.

Deçu par l'absence de réponse... 2 years 7 months ago #467

Thanks David
Still no go...

.. /usr/lib/aarch64-linux-gnu/libQt5Gui.so.5.9.5 /usr/lib/aarch64-linux-gnu/libQt5Core.so.5.9.5
/usr/bin/ld: /usr/lib/gcc/aarch64-linux-gnu/7/../../../aarch64-linux-gnu/libnova.a(julian_day.o): relocation R_AARCH64_ADR_PREL_PG_HI21 against symbol `__stack_chk_guard@@GLIBC_2.17' which may bind externally can not be used when making a shared object; recompile with -fPIC
/usr/bin/ld: /usr/lib/gcc/aarch64-linux-gnu/7/../../../aarch64-linux-gnu/libnova.a(julian_day.o)(.text+0x4): unresolvable R_AARCH64_ADR_PREL_PG_HI21 relocation against symbol `__stack_chk_guard@@GLIBC_2.17'
/usr/bin/ld: final link failed: Bad value
collect2: error: ld returned 1 exit status
src/CMakeFiles/XyGrib.dir/build.make:2848: recipe for target 'src/XyGrib' failed
make[2]: *** [src/XyGrib] Error 1
make[2]: Leaving directory '/home/pytheas/XyGrib/build'
CMakeFiles/Makefile2:102: recipe for target 'src/CMakeFiles/XyGrib.dir/all' failed
make[1]: *** [src/CMakeFiles/XyGrib.dir/all] Error 2
make[1]: Leaving directory '/home/pytheas/XyGrib/build'
Makefile:132: recipe for target 'all' failed
make: *** [all] Error 2

Please Log in or Create an account to join the conversation.

Last edit: by Pytheas.
  • Page:
  • 1
Time to create page: 0.025 seconds

Resources on this site will always be free and open with no commercialization. However, operating costs of the servers to pre-process and deliver GRIB files to XyGrib are not trivial.

If you found the site useful, please share in the effort and help keep us up and running

 

Please Support

Go to top